id,npre,premealsd1,preday1first,preday1last,premealsd2,preday2first,preday2last,premealsd3,preday3first,preday3last,premealsd4,preday4first,preday4last,ny1,y1mealsd1,y1day1first,y1day1last,y1mealsd2,y1day2first,y1day2last,y1mealsd3,y1day3first,y1day3last,y1mealsd4,y1day4first,y1day4last,ny4,y4mealsd1,y4day1first,y4day1last,y4mealsd2,y4day2first,y4day2last,y4mealsd3,y4day3first,y4day3last,y4mealsd4,y4day4first,y4day4last
1002,4,5,7:30:00,19:00:00,7,8:30:00,18:00:00,4,6:30:00,16:15:00,5,6:30:00,16:00:00,3,3,8:00:00,12:30:00,7,3:00:00,17:30:00,7,3:00:00,18:00:00,,,,3,4,7:00:00,19:30:00,7,0:15:00,17:00:00,3,10:15:00,21:00:00,,,
1003,,,,,,,,,,,,,,,,,,,,,,,,,,,,,,,,,,,,,,,
1005,4,4,7:00:00,19:00:00,4,8:00:00,19:00:00,2,12:00:00,18:00:00,2,7:00:00,19:00:00,4,2,9:30:00,17:00:00,3,9:00:00,19:00:00,3,7:00:00,18:00:00,3,7:00:00,18:00:00,4,4,7:30:00,21:00:00,3,7:30:00,21:00:00,4,8:00:00,20:00:00,3,7:30:00,19:00:00
1007,4,3,7:00:00,18:00:00,3,7:00:00,18:00:00,3,7:00:00,18:00:00,3,7:00:00,19:00:00,3,2,10:30:00,13:30:00,5,9:30:00,22:00:00,4,7:00:00,19:30:00,,,,4,5,10:00:00,20:30:00,4,8:00:00,19:00:00,3,8:15:00,22:00:00,3,10:00:00,19:00:00
1008,3,4,11:00:00,20:00:00,3,10:00:00,19:00:00,4,7:30:00,18:00:00,,,,,,,,,,,,,,,,,,,,,,,,,,,,,
1009,3,3,7:00:00,18:00:00,3,8:00:00,18:00:00,2,8:00:00,18:00:00,,,,4,2,9:00:00,18:00:00,3,9:00:00,18:00:00,2,8:30:00,17:00:00,4,9:00:00,22:00:00,3,2,8:00:00,17:30:00,3,8:00:00,18:30:00,2,9:00:00,18:00:00,,,
1010,3,4,7:00:00,18:00:00,3,7:00:00,18:00:00,4,7:00:00,18:00:00,,,,4,5,8:00:00,19:00:00,4,6:30:00,20:00:00,5,7:00:00,19:30:00,4,12:00:00,19:30:00,4,7,8:40:00,20:00:00,4,7:00:00,19:00:00,3,9:00:00,19:00:00,4,7:19:00,18:00:00
1011,4,3,7:00:00,18:00:00,2,7:00:00,18:00:00,3,7:00:00,18:00:00,4,7:00:00,18:00:00,3,4,6:00:00,19:30:00,2,11:30:00,19:00:00,3,8:00:00,18:30:00,,,,,,,,,,,,,,,,
1012,4,3,8:00:00,18:00:00,3,7:00:00,18:00:00,2,7:00:00,15:00:00,3,7:00:00,18:00:00,4,2,7:00:00,18:30:00,3,7:00:00,20:30:00,3,6:30:00,18:30:00,3,7:00:00,18:30:00,3,3,6:30:00,18:00:00,3,6:00:00,18:00:00,3,6:30:00,21:00:00,,,
1015,4,2,7:00:00,18:00:00,3,7:00:00,18:00:00,2,7:00:00,18:00:00,3,7:00:00,18:00:00,,,,,,,,,,,,,,,,,,,,,,,,,,
1017,3,3,7:00:00,18:00:00,3,7:00:00,18:00:00,4,8:00:00,20:00:00,,,,,,,,,,,,,,,,,,,,,,,,,,,,,
1018,4,6,7:00:00,20:00:00,6,7:00:00,22:00:00,5,8:00:00,20:00:00,3,7:00:00,18:00:00,4,5,10:00:00,23:00:00,7,9:30:00,22:00:00,3,8:30:00,22:30:00,6,7:30:00,22:30:00,4,5,1:03:00,19:00:00,4,10:00:00,19:00:00,5,0:00:00,21:00:00,3,6:15:00,18:00:00
1019,4,3,7:00:00,18:00:00,3,7:00:00,17:00:00,3,7:00:00,17:00:00,3,7:00:00,17:00:00,4,2,13:00:00,18:00:00,3,7:30:00,19:00:00,3,8:00:00,18:00:00,4,8:00:00,18:30:00,4,3,7:00:00,19:00:00,5,7:00:00,22:00:00,4,8:30:00,19:15:00,3,10:00:00,18:00:00
1020,4,3,7:00:00,18:00:00,3,7:00:00,18:00:00,4,7:00:00,18:00:00,4,8:00:00,18:00:00,,,,,,,,,,,,,,,,,,,,,,,,,,
1022,4,3,7:00:00,18:00:00,3,7:00:00,18:00:00,3,7:00:00,18:00:00,2,12:00:00,18:00:00,4,6,6:15:00,19:30:00,6,7:00:00,20:00:00,6,6:15:00,20:00:00,5,7:30:00,20:00:00,4,4,9:30:00,18:30:00,5,9:00:00,18:00:00,4,6:15:00,19:30:00,3,6:30:00,18:30:00
1025,4,4,7:00:00,15:00:00,4,7:00:00,18:00:00,1,7:00:00,7:00:00,2,7:00:00,12:00:00,3,4,9:00:00,20:00:00,7,7:30:00,21:20:00,5,8:00:00,20:00:00,,,,,,,,,,,,,,,,
1026,4,4,8:00:00,18:30:00,5,8:00:00,18:00:00,4,7:30:00,17:00:00,4,7:00:00,21:00:00,4,4,7:30:00,22:30:00,5,6:00:00,18:00:00,4,6:00:00,19:00:00,4,7:30:00,18:00:00,4,4,9:00:00,16:30:00,5,9:00:00,18:30:00,7,9:00:00,22:00:00,4,9:00:00,15:00:00
1027,4,3,7:00:00,18:00:00,2,11:00:00,16:00:00,4,8:00:00,19:00:00,3,8:00:00,18:00:00,3,4,9:00:00,18:30:00,4,9:00:00,18:00:00,4,8:30:00,18:00:00,,,,3,3,10:00:00,19:00:00,4,10:00:00,20:30:00,5,9:00:00,20:00:00,,,
1028,4,6,7:30:00,21:30:00,6,7:20:00,22:00:00,8,7:15:00,22:00:00,4,7:15:00,19:00:00,,,,,,,,,,,,,,3,5,6:00:00,19:00:00,4,7:00:00,13:00:00,5,5:00:00,18:15:00,,,
1029,4,3,7:00:00,18:00:00,5,7:00:00,21:00:00,4,7:00:00,18:00:00,4,8:00:00,20:00:00,4,4,8:00:00,17:30:00,4,4:00:00,17:30:00,6,6:00:00,20:00:00,5,7:30:00,21:00:00,4,4,5:00:00,17:00:00,6,6:45:00,19:00:00,4,5:45:00,17:00:00,6,1:04:00,19:00:00
1031,4,3,7:00:00,18:00:00,3,7:00:00,18:00:00,3,8:00:00,18:00:00,4,8:00:00,18:00:00,4,4,7:30:00,18:30:00,5,10:15:00,6:30:00,5,7:00:00,19:00:00,4,8:30:00,18:00:00,4,3,7:00:00,17:30:00,3,7:00:00,18:00:00,4,7:00:00,17:00:00,5,6:30:00,18:00:00
1032,4,5,7:00:00,21:00:00,4,7:00:00,18:00:00,4,7:00:00,18:00:00,4,7:00:00,20:00:00,4,4,9:30:00,18:00:00,7,6:00:00,21:00:00,5,9:00:00,18:00:00,4,5:45:00,18:30:00,4,6,8:00:00,20:45:00,5,6:00:00,19:30:00,6,6:00:00,20:30:00,6,7:00:00,20:30:00
1033,4,2,7:00:00,18:00:00,3,7:00:00,18:00:00,4,7:00:00,18:00:00,3,7:00:00,18:00:00,4,3,7:30:00,20:30:00,3,8:00:00,21:00:00,3,7:30:00,23:30:00,4,8:00:00,20:30:00,4,3,11:00:00,20:00:00,3,11:00:00,21:00:00,3,8:00:00,20:30:00,5,7:30:00,20:30:00
1034,4,3,12:00:00,20:00:00,3,8:00:00,18:00:00,3,10:00:00,20:00:00,2,7:00:00,19:00:00,,,,,,,,,,,,,,,,,,,,,,,,,,
1035,4,1,7:00:00,7:00:00,4,7:00:00,19:00:00,3,8:00:00,16:30:00,3,7:00:00,19:00:00,3,3,7:30:00,16:00:00,3,7:30:00,6:30:00,3,7:30:00,18:00:00,,,,4,5,7:00:00,20:00:00,3,7:30:00,18:30:00,2,6:30:00,16:30:00,4,7:00:00,18:30:00
1036,4,4,7:00:00,18:00:00,3,7:00:00,18:00:00,4,7:00:00,21:00:00,4,7:00:00,18:00:00,4,4,6:15:00,18:00:00,6,6:15:00,21:00:00,3,8:30:00,18:00:00,5,6:00:00,18:00:00,4,6,8:00:00,18:30:00,6,6:30:00,18:30:00,5,6:30:00,21:30:00,5,6:30:00,18:00:00
1037,4,3,10:00:00,19:00:00,5,7:00:00,21:00:00,4,8:00:00,19:00:00,4,7:00:00,20:00:00,4,5,6:45:00,19:00:00,3,7:00:00,17:30:00,6,7:00:00,21:00:00,4,6:30:00,18:00:00,4,5,7:45:00,21:00:00,4,7:00:00,20:30:00,3,8:00:00,18:00:00,2,11:30:00,17:30:00
1038,4,3,7:00:00,18:00:00,4,7:00:00,19:00:00,6,7:00:00,20:15:00,4,7:00:00,18:30:00,4,4,9:00:00,19:00:00,4,7:30:00,18:30:00,4,8:00:00,18:30:00,7,7:30:00,21:00:00,4,7,6:30:00,19:15:00,7,6:40:00,19:30:00,6,6:10:00,19:00:00,7,6:40:00,21:15:00
1039,4,4,8:00:00,18:00:00,2,7:00:00,12:00:00,4,8:00:00,20:00:00,3,7:00:00,18:00:00,4,3,8:00:00,18:00:00,5,8:00:00,20:00:00,4,8:00:00,18:00:00,3,8:00:00,18:00:00,,,,,,,,,,,,,
1040,4,4,8:00:00,19:30:00,4,8:00:00,20:00:00,6,8:00:00,20:30:00,3,7:00:00,18:00:00,4,4,7:30:00,21:00:00,5,8:00:00,22:00:00,4,8:30:00,19:30:00,3,8:30:00,17:00:00,4,6,9:00:00,17:00:00,3,7:30:00,18:00:00,6,8:30:00,20:00:00,7,8:30:00,20:00:00
1041,4,3,9:30:00,21:00:00,2,8:00:00,13:00:00,2,9:00:00,15:00:00,3,11:00:00,17:30:00,,,,,,,,,,,,,,,,,,,,,,,,,,
1042,4,4,7:00:00,18:00:00,4,8:00:00,18:00:00,4,8:00:00,20:00:00,4,7:00:00,22:00:00,4,3,7:30:00,19:00:00,3,8:00:00,18:00:00,3,7:30:00,19:00:00,5,7:15:00,22:00:00,4,4,7:30:00,20:00:00,3,9:00:00,17:30:00,4,7:15:00,22:00:00,3,7:15:00,20:00:00
1043,4,3,8:00:00,18:00:00,4,7:00:00,22:00:00,4,7:00:00,18:00:00,4,6:00:00,19:00:00,3,4,9:00:00,22:00:00,5,8:00:00,18:00:00,5,8:30:00,23:00:00,,,,3,5,9:30:00,22:00:00,3,8:45:00,18:30:00,5,7:30:00,21:30:00,,,
1044,4,4,7:00:00,19:00:00,3,7:00:00,18:00:00,3,8:00:00,17:00:00,3,8:00:00,19:00:00,3,4,7:30:00,18:00:00,3,6:30:00,19:30:00,3,8:00:00,20:30:00,,,,3,6,7:00:00,20:30:00,6,8:00:00,20:00:00,6,7:00:00,21:00:00,,,
1045,4,3,8:00:00,17:00:00,3,7:00:00,18:00:00,3,7:00:00,18:00:00,4,8:00:00,19:00:00,,,,,,,,,,,,,,,,,,,,,,,,,,
1046,4,5,7:00:00,19:00:00,3,8:00:00,19:00:00,3,8:00:00,18:00:00,5,8:00:00,19:00:00,4,4,9:00:00,18:00:00,4,6:30:00,18:00:00,4,6:30:00,19:00:00,4,6:30:00,19:00:00,,,,,,,,,,,,,
1047,3,3,8:00:00,17:00:00,4,8:00:00,20:00:00,3,7:00:00,18:00:00,,,,,,,,,,,,,,,,,4,6,6:45:00,19:30:00,10,8:30:00,21:30:00,5,9:00:00,18:15:00,6,7:30:00,18:00:00
1048,4,7,7:00:00,22:00:00,5,8:00:00,18:00:00,4,8:00:00,22:00:00,4,8:00:00,18:00:00,4,6,6:30:00,20:30:00,3,7:30:00,17:30:00,4,6:00:00,6:30:00,5,7:00:00,18:00:00,4,5,7:00:00,19:30:00,6,6:15:00,20:30:00,5,8:00:00,20:00:00,5,7:00:00,19:00:00
1049,4,4,7:00:00,18:00:00,5,8:00:00,19:00:00,1,7:00:00,7:00:00,3,8:00:00,18:00:00,4,3,9:00:00,15:00:00,3,3:30:00,19:00:00,3,8:00:00,17:00:00,4,6:45:00,18:30:00,4,5,8:45:00,20:30:00,5,7:00:00,19:45:00,5,8:00:00,19:30:00,5,6:30:00,21:30:00
1050,4,7,7:00:00,21:00:00,4,8:30:00,18:00:00,3,8:00:00,18:30:00,4,9:00:00,20:00:00,4,3,7:00:00,18:00:00,4,6:00:00,19:30:00,4,6:00:00,18:00:00,3,6:30:00,19:00:00,4,4,7:30:00,19:30:00,2,9:00:00,18:30:00,4,8:00:00,18:00:00,4,7:00:00,18:30:00
1052,3,3,10:00:00,17:45:00,4,8:00:00,19:00:00,5,7:10:00,17:45:00,,,,,,,,,,,,,,,,,,,,,,,,,,,,,
1053,3,3,7:00:00,19:00:00,5,7:00:00,19:00:00,4,8:00:00,21:00:00,,,,4,5,8:00:00,23:00:00,4,8:00:00,19:00:00,3,7:30:00,18:00:00,4,7:00:00,18:00:00,,,,,,,,,,,,,
1054,4,4,8:00:00,18:00:00,3,7:00:00,23:00:00,3,8:00:00,18:00:00,3,8:00:00,18:00:00,4,4,10:00:00,19:00:00,3,11:00:00,18:00:00,3,8:00:00,18:00:00,3,8:00:00,16:00:00,4,3,9:00:00,18:00:00,2,9:00:00,12:00:00,6,7:00:00,20:00:00,3,7:00:00,18:00:00
1055,3,3,7:00:00,18:00:00,3,7:00:00,18:00:00,5,9:00:00,19:00:00,,,,3,3,10:00:00,19:00:00,4,7:00:00,20:00:00,2,11:00:00,19:00:00,,,,3,3,9:30:00,18:00:00,3,9:45:00,18:30:00,4,7:00:00,20:00:00,,,
1056,2,3,8:00:00,18:00:00,3,8:00:00,14:00:00,,,,,,,3,4,7:00:00,18:30:00,5,7:00:00,18:00:00,4,6:00:00,18:00:00,,,,3,5,7:00:00,18:30:00,4,7:00:00,19:00:00,4,7:00:00,19:00:00,,,
1057,4,4,9:00:00,22:00:00,4,8:00:00,22:00:00,3,8:00:00,17:00:00,3,8:00:00,18:00:00,,,,,,,,,,,,,,,,,,,,,,,,,,
1058,3,7,6:00:00,19:30:00,5,5:10:00,18:15:00,4,5:30:00,19:00:00,,,,4,5,6:50:00,19:00:00,6,6:50:00,20:20:00,6,6:00:00,20:00:00,2,8:00:00,17:00:00,,,,,,,,,,,,,
1059,4,2,8:00:00,18:00:00,3,8:00:00,18:00:00,3,8:00:00,18:00:00,3,8:00:00,18:00:00,4,5,6:30:00,20:05:00,5,7:00:00,19:00:00,7,6:35:00,19:00:00,4,7:00:00,18:30:00,4,4,8:00:00,20:15:00,4,6:36:00,21:20:00,4,8:00:00,18:10:00,4,7:40:00,18:30:00
1060,4,5,8:00:00,22:00:00,3,14:00:00,22:00:00,3,9:30:00,20:00:00,3,8:30:00,17:00:00,3,5,8:00:00,20:00:00,5,9:00:00,20:00:00,6,9:00:00,21:15:00,,,,,,,,,,,,,,,,
1061,4,3,8:00:00,18:00:00,5,8:00:00,19:00:00,3,9:30:00,19:30:00,4,8:00:00,20:00:00,4,5,8:00:00,18:00:00,6,6:00:00,20:00:00,3,6:00:00,17:00:00,5,7:00:00,20:00:00,4,3,7:00:00,18:00:00,3,7:00:00,20:00:00,3,7:00:00,19:30:00,3,7:00:00,18:00:00
1062,4,7,10:00:00,23:00:00,4,6:00:00,19:00:00,3,7:00:00,19:00:00,5,6:30:00,21:00:00,4,5,8:30:00,21:00:00,4,7:30:00,18:00:00,4,7:30:00,18:30:00,6,7:00:00,20:30:00,4,6,7:30:00,19:30:00,5,7:00:00,18:30:00,4,8:00:00,21:30:00,5,7:00:00,19:00:00
1063,4,3,8:00:00,19:00:00,1,8:00:00,8:00:00,4,7:30:00,20:00:00,4,8:15:00,22:00:00,4,4,8:00:00,19:00:00,3,8:00:00,18:00:00,3,8:45:00,18:00:00,3,8:00:00,19:00:00,4,4,9:30:00,19:30:00,5,9:30:00,19:00:00,4,8:00:00,19:00:00,5,9:30:00,19:00:00
1064,4,3,8:00:00,18:30:00,3,8:15:00,17:30:00,3,7:00:00,17:40:00,5,7:00:00,18:00:00,4,3,8:00:00,18:00:00,4,8:00:00,18:00:00,3,8:30:00,18:00:00,3,8:00:00,18:00:00,3,4,7:00:00,17:45:00,4,7:25:00,22:40:00,4,7:30:00,19:00:00,,,
1065,3,4,8:00:00,19:00:00,4,8:00:00,19:30:00,3,8:00:00,21:00:00,,,,4,4,8:00:00,19:00:00,3,8:00:00,20:00:00,4,8:00:00,18:00:00,3,8:00:00,18:00:00,4,4,8:00:00,21:00:00,3,7:00:00,21:00:00,6,8:30:00,22:00:00,4,7:00:00,19:00:00
1066,3,2,9:00:00,18:00:00,1,12:00:00,12:00:00,3,7:00:00,19:00:00,,,,4,3,8:00:00,19:00:00,3,10:30:00,18:00:00,3,7:00:00,19:00:00,2,9:00:00,14:00:00,3,4,7:00:00,19:00:00,4,9:00:00,21:00:00,4,9:00:00,19:00:00,,,
1067,4,7,6:30:00,19:45:00,2,10:00:00,19:30:00,4,9:30:00,19:00:00,4,6:15:00,18:00:00,,,,,,,,,,,,,,,,,,,,,,,,,,
1069,4,3,8:30:00,17:00:00,4,8:00:00,18:30:00,4,8:00:00,20:00:00,5,9:00:00,19:00:00,4,3,8:00:00,19:00:00,6,7:30:00,19:30:00,5,7:30:00,19:00:00,3,7:00:00,18:30:00,,,,,,,,,,,,,
1070,3,10,7:30:00,20:00:00,7,7:30:00,18:45:00,9,6:00:00,20:30:00,5,7:30:00,21:00:00,,,,,,,,,,,,,,,,,,,,,,,,,,
1071,3,3,6:30:00,19:00:00,4,8:00:00,18:00:00,3,8:00:00,17:00:00,,,,3,3,9:00:00,18:00:00,5,9:00:00,18:00:00,4,9:30:00,19:00:00,,,,,,,,,,,,,,,,
1072,3,4,9:00:00,19:50:00,4,7:30:00,18:00:00,4,9:15:00,19:00:00,,,,4,5,6:00:00,17:30:00,5,5:00:00,16:00:00,5,7:00:00,18:00:00,4,6:00:00,19:00:00,4,6,6:30:00,19:00:00,6,6:00:00,19:00:00,4,6:00:00,19:00:00,4,6:30:00,19:00:00
1074,3,4,7:00:00,18:00:00,4,6:00:00,12:00:00,3,6:00:00,12:00:00,,,,,,,,,,,,,,,,,,,,,,,,,,,,,
1075,4,3,8:30:00,20:30:00,5,8:30:00,19:10:00,4,7:10:00,20:30:00,5,8:30:00,18:30:00,4,4,7:30:00,19:00:00,5,7:25:00,21:20:00,5,5:00:00,21:00:00,7,8:30:00,20:30:00,4,4,8:15:00,19:52:00,4,7:00:00,18:30:00,3,8:20:00,18:30:00,3,8:00:00,19:00:00
1076,3,4,6:30:00,21:00:00,2,13:30:00,18:30:00,3,6:30:00,19:30:00,,,,,,,,,,,,,,,,,,,,,,,,,,,,,
1077,4,5,7:00:00,20:00:00,7,8:30:00,19:30:00,5,5:30:00,20:00:00,4,7:30:00,21:00:00,4,3,9:30:00,19:00:00,3,10:00:00,19:30:00,3,9:30:00,17:30:00,6,9:45:00,18:30:00,3,4,7:30:00,20:00:00,4,6:30:00,18:30:00,7,7:00:00,20:00:00,,,
1078,,,,,,,,,,,,,,,,,,,,,,,,,,,,,,,,,,,,,,,
1079,4,3,6:30:00,17:30:00,3,7:00:00,18:00:00,4,6:30:00,20:00:00,4,7:30:00,19:00:00,,,,,,,,,,,,,,4,4,8:00:00,21:00:00,5,6:30:00,19:00:00,4,10:00:00,20:00:00,4,12:00:00,18:00:00
1080,4,5,7:30:00,18:30:00,4,8:00:00,18:30:00,6,7:30:00,18:30:00,4,7:30:00,18:30:00,,,,,,,,,,,,,,4,6,7:00:00,18:30:00,5,8:00:00,19:20:00,7,8:30:00,18:30:00,6,7:30:00,18:30:00
1081,4,4,8:00:00,20:00:00,7,8:00:00,22:00:00,4,7:30:00,19:00:00,4,8:15:00,21:30:00,4,5,9:00:00,22:30:00,3,9:00:00,20:00:00,4,7:00:00,19:00:00,4,8:00:00,22:00:00,4,5,8:30:00,19:00:00,5,8:30:00,19:30:00,4,8:30:00,19:30:00,3,10:00:00,19:30:00
1082,3,4,8:25:00,20:00:00,4,7:30:00,19:30:00,3,7:00:00,19:00:00,,,,4,3,6:30:00,18:00:00,6,4:00:00,20:00:00,4,6:45:00,18:00:00,5,6:30:00,20:00:00,3,5,7:00:00,21:00:00,5,6:30:00,19:30:00,3,7:30:00,18:30:00,,,
1083,4,4,9:00:00,20:00:00,4,5:30:00,23:30:00,3,7:00:00,19:30:00,5,5:30:00,21:00:00,4,5,5:30:00,20:00:00,4,5:30:00,18:00:00,2,5:30:00,12:00:00,4,0:30:00,18:00:00,,,,,,,,,,,,,
1084,4,4,7:15:00,21:30:00,4,10:40:00,21:00:00,4,8:15:00,19:10:00,5,8:30:00,19:40:00,4,4,8:30:00,22:00:00,4,8:00:00,21:30:00,4,8:45:00,20:20:00,5,9:10:00,21:30:00,4,4,8:30:00,19:00:00,6,9:00:00,23:35:00,4,1:45:00,23:00:00,4,8:00:00,19:30:00
1085,4,4,9:00:00,18:30:00,5,7:30:00,17:00:00,4,7:30:00,17:15:00,5,8:00:00,19:30:00,4,5,8:00:00,20:00:00,2,8:00:00,12:00:00,4,8:00:00,17:30:00,4,8:00:00,17:00:00,4,4,7:00:00,18:00:00,4,7:00:00,18:30:00,4,7:00:00,18:30:00,3,7:00:00,18:30:00
1086,3,4,7:30:00,20:00:00,3,7:30:00,21:00:00,4,9:30:00,21:00:00,,,,4,4,6:00:00,18:00:00,3,9:00:00,19:00:00,3,8:00:00,19:00:00,4,2:00:00,20:00:00,4,3,10:00:00,19:00:00,3,8:00:00,19:00:00,3,8:00:00,18:00:00,3,8:00:00,19:00:00
1087,3,4,7:00:00,18:00:00,3,7:00:00,18:00:00,2,12:30:00,18:30:00,,,,3,4,8:00:00,19:00:00,3,8:00:00,19:00:00,4,6:00:00,19:00:00,,,,3,3,7:00:00,17:00:00,5,7:00:00,19:00:00,5,8:30:00,18:00:00,,,
1088,3,3,8:00:00,17:30:00,4,8:00:00,17:30:00,4,7:30:00,17:30:00,,,,4,3,8:30:00,17:00:00,3,7:20:00,19:00:00,3,7:20:00,19:00:00,3,8:00:00,18:00:00,,,,,,,,,,,,,
1089,4,3,6:30:00,20:00:00,4,6:20:00,20:00:00,3,6:20:00,18:15:00,5,6:30:00,19:00:00,4,6,6:30:00,21:00:00,2,8:00:00,20:30:00,5,6:00:00,20:30:00,3,9:00:00,22:30:00,4,2,6:10:00,18:30:00,3,6:15:00,22:00:00,3,6:10:00,17:30:00,4,9:00:00,21:00:00
1090,4,5,6:20:00,18:00:00,6,6:15:00,18:15:00,5,7:30:00,20:30:00,5,8:00:00,20:30:00,4,3,9:00:00,19:00:00,4,6:30:00,19:00:00,4,7:30:00,19:00:00,3,6:30:00,19:30:00,4,4,8:30:00,20:00:00,5,7:00:00,22:00:00,4,2:30:00,18:30:00,5,6:10:00,19:00:00
1092,4,7,10:00:00,19:45:00,6,6:00:00,21:00:00,4,10:00:00,22:00:00,7,6:00:00,19:00:00,4,7,7:00:00,22:45:00,4,8:00:00,18:00:00,8,6:00:00,22:00:00,6,8:30:00,20:00:00,4,5,14:00:00,21:45:00,6,6:00:00,20:30:00,7,8:45:00,21:30:00,7,6:00:00,19:00:00
1093,4,6,8:10:00,21:30:00,6,8:45:00,21:30:00,5,6:30:00,18:30:00,6,7:15:00,22:00:00,4,4,8:00:00,17:45:00,7,2:30:00,21:30:00,5,8:00:00,21:00:00,4,10:00:00,22:45:00,4,6,8:30:00,23:30:00,5,8:10:00,22:00:00,8,7:00:00,23:00:00,5,7:30:00,22:30:00
1095,4,3,9:00:00,21:00:00,5,8:00:00,19:00:00,5,8:30:00,22:00:00,2,8:00:00,18:30:00,4,,,,,,,,,,,,,,,,,,,,,,,,,
1096,4,3,10:00:00,19:45:00,5,8:00:00,20:00:00,4,7:30:00,20:00:00,2,7:30:00,20:30:00,3,4,7:00:00,19:30:00,3,7:30:00,19:00:00,3,8:30:00,19:00:00,,,,4,4,5:30:00,19:45:00,5,6:00:00,21:00:00,4,6:30:00,19:00:00,4,8:00:00,20:00:00
1097,4,3,6:00:00,19:00:00,3,8:00:00,21:00:00,3,7:00:00,21:30:00,3,7:00:00,19:00:00,4,3,6:30:00,23:00:00,5,6:30:00,21:30:00,5,5:30:00,21:00:00,3,6:30:00,18:00:00,4,5,7:00:00,20:00:00,5,7:30:00,20:00:00,4,8:00:00,21:00:00,6,8:00:00,21:00:00
1098,4,5,8:00:00,20:00:00,3,9:30:00,18:00:00,4,8:00:00,20:00:00,5,8:00:00,20:30:00,,,,,,,,,,,,,,,,,,,,,,,,,,
1099,4,3,6:45:00,18:00:00,3,8:30:00,18:30:00,4,6:30:00,18:00:00,4,8:30:00,21:00:00,,,,,,,,,,,,,,,,,,,,,,,,,,
1100,4,8,9:30:00,19:00:00,4,10:40:00,21:30:00,3,10:30:00,19:00:00,4,10:00:00,19:30:00,4,3,8:00:00,18:00:00,2,7:00:00,19:00:00,2,6:00:00,12:00:00,3,8:00:00,18:00:00,4,4,8:00:00,19:00:00,3,8:00:00,18:00:00,3,8:00:00,17:30:00,3,7:00:00,18:15:00
1101,3,6,4:30:00,16:00:00,6,7:00:00,18:30:00,7,4:30:00,19:30:00,,,,4,2,7:00:00,14:00:00,4,4:00:00,18:00:00,2,7:00:00,12:00:00,3,4:30:00,17:30:00,,,,,,,,,,,,,
1102,4,3,9:30:00,16:00:00,4,9:00:00,21:00:00,3,9:00:00,19:30:00,3,14:00:00,20:00:00,,,,,,,,,,,,,,,,,,,,,,,,,,
1103,3,2,6:30:00,20:30:00,6,8:30:00,22:00:00,4,9:00:00,18:00:00,,,,4,2,8:00:00,18:00:00,2,11:00:00,15:00:00,2,8:00:00,17:00:00,3,8:00:00,18:00:00,,,,,,,,,,,,,
1104,4,5,8:00:00,22:05:00,5,7:45:00,19:45:00,6,7:15:00,20:30:00,5,6:00:00,18:30:00,4,3,10:00:00,19:00:00,5,6:30:00,19:30:00,3,10:00:00,17:00:00,4,5:30:00,20:00:00,4,5,5:30:00,19:00:00,8,1:15:00,20:00:00,5,6:30:00,21:00:00,4,7:30:00,19:30:00
1105,4,3,8:00:00,19:30:00,5,8:15:00,22:30:00,4,9:00:00,20:30:00,5,9:30:00,21:30:00,4,3,8:30:00,18:00:00,3,10:15:00,18:00:00,3,8:15:00,18:00:00,2,9:30:00,18:30:00,,,,,,,,,,,,,
1106,4,5,4:45:00,19:00:00,5,4:45:00,17:30:00,4,4:45:00,16:00:00,3,5:00:00,13:00:00,4,2,4:00:00,15:00:00,4,4:00:00,16:00:00,5,4:00:00,17:00:00,5,4:30:00,19:00:00,4,5,8:00:00,20:00:00,4,7:00:00,19:00:00,4,8:00:00,19:00:00,4,8:30:00,20:00:00
1107,4,4,8:00:00,18:00:00,4,8:00:00,19:00:00,6,9:30:00,21:00:00,6,7:00:00,19:00:00,4,3,7:00:00,19:00:00,3,10:00:00,18:30:00,3,6:30:00,19:00:00,3,7:30:00,18:00:00,4,6,7:30:00,19:45:00,5,8:30:00,18:00:00,5,8:00:00,20:00:00,4,7:30:00,20:30:00
1108,4,4,7:30:00,19:00:00,5,7:30:00,18:00:00,4,1:30:00,20:00:00,5,10:30:00,22:00:00,,,,,,,,,,,,,,,,,,,,,,,,,,
1109,4,4,9:30:00,22:00:00,4,10:45:00,21:00:00,4,12:45:00,22:00:00,3,17:00:00,22:00:00,4,3,9:00:00,17:00:00,4,10:00:00,19:30:00,4,7:00:00,19:00:00,3,9:00:00,19:00:00,4,4,10:00:00,21:00:00,4,9:00:00,21:00:00,4,9:00:00,22:00:00,3,10:00:00,21:00:00
1110,4,4,9:00:00,19:30:00,6,9:30:00,20:00:00,4,8:00:00,19:30:00,5,9:00:00,20:30:00,4,6,8:00:00,21:30:00,7,7:15:00,20:00:00,4,7:30:00,21:00:00,5,9:30:00,19:30:00,4,5,8:00:00,19:00:00,7,7:00:00,21:00:00,8,7:00:00,21:00:00,6,9:00:00,20:00:00
1111,4,3,10:00:00,19:30:00,4,5:30:00,12:30:00,3,8:30:00,19:30:00,3,7:00:00,18:30:00,4,3,9:30:00,18:00:00,3,7:30:00,19:30:00,3,7:15:00,19:00:00,4,7:00:00,22:30:00,3,4,7:15:00,23:30:00,5,7:15:00,23:00:00,5,7:15:00,23:00:00,,,
1112,4,2,11:30:00,21:30:00,3,9:30:00,17:45:00,3,8:15:00,17:30:00,3,7:40:00,17:30:00,4,3,10:15:00,22:00:00,3,9:15:00,18:00:00,3,11:30:00,18:00:00,2,10:30:00,16:00:00,4,4,10:15:00,18:00:00,2,6:00:00,13:00:00,5,9:30:00,23:45:00,3,9:00:00,19:00:00
1113,4,4,6:15:00,20:00:00,4,7:00:00,21:00:00,6,6:15:00,22:00:00,5,4:30:00,20:30:00,4,4,6:15:00,18:15:00,5,3:15:00,21:00:00,4,7:30:00,17:30:00,3,6:00:00,18:00:00,,,,,,,,,,,,,
1114,4,7,8:10:00,22:30:00,3,7:00:00,19:00:00,5,7:00:00,22:00:00,6,7:00:00,22:00:00,4,3,8:00:00,19:00:00,4,7:30:00,18:00:00,4,7:00:00,18:00:00,4,7:00:00,18:00:00,4,4,7:00:00,22:00:00,4,7:00:00,18:00:00,5,7:00:00,22:00:00,5,7:00:00,20:00:00
1115,4,6,6:10:00,21:00:00,6,8:30:00,21:30:00,5,6:20:00,18:00:00,4,7:00:00,19:30:00,4,5,6:00:00,19:00:00,4,8:30:00,18:00:00,6,6:00:00,20:30:00,5,7:30:00,21:00:00,4,3,7:15:00,20:15:00,5,7:45:00,20:00:00,5,10:00:00,21:00:00,5,8:15:00,19:00:00
1116,4,5,8:30:00,21:00:00,5,8:30:00,23:30:00,5,10:00:00,20:00:00,5,8:30:00,21:45:00,4,3,8:00:00,19:00:00,5,7:30:00,18:00:00,5,8:00:00,21:00:00,6,8:00:00,21:30:00,4,5,8:00:00,21:00:00,5,8:30:00,21:00:00,6,9:00:00,21:00:00,6,8:15:00,21:00:00
1117,4,4,6:30:00,18:00:00,5,9:00:00,20:00:00,4,7:00:00,18:00:00,4,8:30:00,20:30:00,,,,,,,,,,,,,,,,,,,,,,,,,,
1119,4,4,7:30:00,21:00:00,5,8:00:00,22:00:00,4,9:00:00,21:00:00,6,6:30:00,17:00:00,,,,,,,,,,,,,,,,,,,,,,,,,,
1120,4,3,8:30:00,19:30:00,2,12:00:00,20:00:00,3,7:00:00,18:00:00,3,9:00:00,18:30:00,1,4,7:00:00,20:00:00,,,,,,,,,,,,,,,,,,,,,,
1121,3,4,7:00:00,21:00:00,3,9:30:00,17:00:00,2,7:00:00,17:00:00,,,,2,3,7:30:00,18:00:00,3,12:00:00,19:00:00,,,,,,,3,5,5:00:00,18:00:00,5,5:30:00,18:00:00,6,6:00:00,20:00:00,,,
1122,4,4,7:00:00,18:30:00,4,8:30:00,20:00:00,4,7:00:00,19:00:00,3,7:00:00,18:00:00,4,3,7:30:00,18:00:00,3,7:00:00,19:00:00,4,7:30:00,21:00:00,5,7:00:00,19:00:00,4,3,5:30:00,17:30:00,3,7:30:00,20:00:00,3,7:30:00,17:30:00,3,7:30:00,17:30:00
1123,4,3,10:30:00,19:00:00,3,8:30:00,19:00:00,3,8:00:00,19:00:00,3,8:00:00,20:00:00,4,4,10:30:00,22:00:00,3,10:30:00,19:00:00,3,6:00:00,12:00:00,4,10:00:00,22:00:00,4,3,9:00:00,20:00:00,4,6:00:00,20:00:00,4,9:00:00,22:00:00,4,9:00:00,18:00:00
1124,4,4,8:00:00,19:00:00,3,6:00:00,17:00:00,5,8:00:00,20:00:00,2,8:00:00,13:00:00,4,2,8:00:00,17:00:00,5,8:30:00,21:30:00,5,7:00:00,20:00:00,4,7:00:00,19:00:00,4,4,8:45:00,20:00:00,4,8:45:00,20:30:00,3,8:00:00,16:00:00,3,8:45:00,18:00:00
1125,4,3,12:30:00,20:00:00,3,8:15:00,19:30:00,2,7:15:00,19:30:00,2,13:15:00,19:00:00,,,,,,,,,,,,,,,,,,,,,,,,,,
1126,3,5,7:30:00,20:00:00,4,8:00:00,20:00:00,3,8:00:00,18:00:00,,,,3,3,2:00:00,18:00:00,3,7:00:00,14:00:00,3,7:00:00,18:00:00,,,,4,5,8:00:00,18:00:00,5,8:00:00,19:00:00,4,8:00:00,19:00:00,4,8:00:00,17:00:00
1127,4,2,13:00:00,19:30:00,2,13:30:00,17:00:00,3,9:00:00,19:00:00,3,7:45:00,20:45:00,4,4,7:00:00,18:00:00,2,9:30:00,19:00:00,3,7:15:00,23:00:00,3,7:00:00,19:00:00,4,1,12:30:00,12:30:00,2,12:30:00,23:00:00,2,10:00:00,15:00:00,3,11:45:00,16:30:00
1128,4,3,7:30:00,22:00:00,5,7:30:00,21:00:00,4,7:00:00,18:00:00,3,8:00:00,18:00:00,3,7,8:00:00,21:45:00,5,7:00:00,21:45:00,5,7:45:00,18:30:00,,,,4,4,11:30:00,22:00:00,4,7:45:00,19:30:00,5,8:00:00,21:00:00,4,8:30:00,21:00:00
1129,4,5,4:30:00,19:30:00,3,7:15:00,16:00:00,4,5:45:00,21:00:00,4,7:00:00,22:30:00,4,4,7:00:00,19:30:00,4,6:00:00,20:00:00,3,5:30:00,18:00:00,3,8:30:00,19:30:00,4,4,6:40:00,21:00:00,4,7:30:00,17:30:00,4,8:00:00,19:00:00,4,12:30:00,21:30:00
1130,4,4,10:00:00,21:00:00,6,9:00:00,21:30:00,5,6:00:00,22:30:00,3,7:00:00,18:00:00,4,4,8:00:00,18:00:00,3,8:30:00,18:00:00,3,9:00:00,22:00:00,3,7:00:00,17:00:00,4,6,9:00:00,21:00:00,7,7:30:00,23:30:00,5,8:00:00,22:30:00,4,12:00:00,23:45:00
1131,4,3,9:30:00,23:30:00,3,8:30:00,19:30:00,4,10:00:00,22:00:00,6,8:00:00,22:00:00,3,4,7:30:00,18:00:00,6,10:00:00,22:30:00,4,7:30:00,20:30:00,,,,,,,,,,,,,,,,
1133,4,5,6:45:00,18:00:00,3,7:30:00,19:00:00,3,6:30:00,18:00:00,5,6:45:00,17:30:00,,,,,,,,,,,,,,,,,,,,,,,,,,
1134,4,5,7:00:00,21:00:00,4,6:15:00,20:45:00,4,8:00:00,18:30:00,6,5:30:00,20:00:00,4,3,8:00:00,17:00:00,3,5:30:00,19:00:00,4,8:00:00,19:00:00,3,7:00:00,18:00:00,4,3,10:00:00,19:00:00,3,10:00:00,18:00:00,4,7:00:00,18:00:00,3,9:30:00,18:00:00
1135,4,5,8:30:00,19:00:00,3,9:00:00,18:00:00,3,8:00:00,18:00:00,4,8:30:00,19:00:00,4,4,7:30:00,18:30:00,3,8:30:00,16:00:00,4,7:00:00,19:00:00,3,9:00:00,19:00:00,4,9,7:30:00,21:00:00,8,7:30:00,21:00:00,8,9:00:00,18:30:00,7,7:00:00,19:40:00
1136,3,1,0:00:00,0:00:00,4,9:15:00,20:00:00,1,0:00:00,0:00:00,,,,3,3,9:30:00,18:00:00,3,7:00:00,15:00:00,3,8:00:00,19:00:00,,,,,,,,,,,,,,,,
1137,4,4,7:30:00,18:00:00,4,9:30:00,20:00:00,4,8:00:00,20:00:00,4,10:00:00,20:00:00,4,3,8:00:00,17:30:00,3,8:00:00,19:00:00,5,7:30:00,20:30:00,5,7:00:00,21:00:00,,,,,,,,,,,,,
1138,3,5,6:30:00,18:00:00,4,8:00:00,20:00:00,4,8:00:00,18:00:00,,,,,,,,,,,,,,,,,,,,,,,,,,,,,
1139,4,4,7:00:00,18:00:00,3,7:00:00,18:00:00,3,7:30:00,18:00:00,3,7:00:00,19:00:00,4,4,7:00:00,21:00:00,4,8:00:00,18:00:00,5,7:00:00,22:15:00,4,9:00:00,19:30:00,4,4,6:45:00,19:00:00,5,6:30:00,17:15:00,5,7:20:00,19:30:00,3,7:15:00,20:00:00